Helix CI #1342
Annotations
5 errors and 1 warning
|
Print Tests Results
Test failed: TestCrushED2RebalanceAssignments(org.apache.helix.integration.rebalancer.CrushRebalancers.TestCrushED2Rebalance) Time elapsed: 31.6 s <<< FAILURE!
|
|
Print Tests Results
Test failed: testMaintenanceModeAddNewResource(org.apache.helix.integration.controller.TestClusterMaintenanceMode) Time elapsed: 1.62 s <<< FAILURE!
|
|
Print Tests Results
Test failed: testResourceThrottle(org.apache.helix.integration.TestPartitionMovementThrottle) Time elapsed: 3.985 s <<< FAILURE!
|
|
Generate Test Report
Failed test were found and 'fail-on-error' option is set to true
|
|
Run All Tests
Process completed with exit code 1.
|
|
Generate Test Report
Test report summary exceeded limit of 65535 bytes and will be trimmed
|
Loading